BDBM168467 US9675593, 27
SMILES: O=c1ccc2CCCc2n1-c1ccccc1
InChI Key: InChIKey=XCLLBVOGLDHMTK-UHFFFAOYSA-N
Data: 1 EC50
Activity Spreadsheet -- Enzyme Inhibition Constant Data from BindingDB
Found 1 hit for monomerid = 168467
Trg + Lig
Ki
nM
ΔG°
kcal/mole
IC50
nM
Kd
nM
EC50/IC50
nM
koff
s-1
kon
M-1s-1
pHTemp
°C
Endothelin-1
(Homo sapiens (Human))
BDBM168467
(US9675593, 27)
Show SMILES O=c1ccc2CCCc2n1-c1ccccc1
Show InChI InChI=1S/C14H13NO/c16-14-10-9-11-5-4-8-13(11)15(14)12-6-2-1-3-7-12/h1-3,6-7,9-10H,4-5,8H2
US Patent
n/an/an/an/a>2.00E+5n/an/an/an/a
SRMLSC
US Patent
Assay Description
Fibroblasts (primary human lung and dermal, HFL-1, 3T3 etc) are seeded in 96-well plates at ~15000 cells/well and serum starved for 0-48 hours. After...
US Patent US9675593 (2017)
BindingDB Entry DOI: 10.7270/Q2319T24