BDBM168482 US9675593, 43
SMILES: Cn1cc(cn1)-c1cn(-c2ccc(OC(F)(F)F)cc2)c(=O)c2cccnc12
InChI Key: InChIKey=KEWSHFUEFOZTPX-UHFFFAOYSA-N
Data: 1 EC50
Activity Spreadsheet -- Enzyme Inhibition Constant Data from BindingDB
Found 1 hit for monomerid = 168482
Trg + Lig
Ki
nM
ΔG°
kcal/mole
IC50
nM
Kd
nM
EC50/IC50
nM
koff
s-1
kon
M-1s-1
pHTemp
°C
Endothelin-1
(Homo sapiens (Human))
BDBM168482
(US9675593, 43)
Show SMILES Cn1cc(cn1)-c1cn(-c2ccc(OC(F)(F)F)cc2)c(=O)c2cccnc12
Show InChI InChI=1S/C19H13F3N4O2/c1-25-10-12(9-24-25)16-11-26(18(27)15-3-2-8-23-17(15)16)13-4-6-14(7-5-13)28-19(20,21)22/h2-11H,1H3
US Patent
n/an/an/an/a<5.00E+4n/an/an/an/a
SRMLSC
US Patent
Assay Description
Fibroblasts (primary human lung and dermal, HFL-1, 3T3 etc) are seeded in 96-well plates at ~15000 cells/well and serum starved for 0-48 hours. After...
US Patent US9675593 (2017)
BindingDB Entry DOI: 10.7270/Q2319T24