BDBM168484 US9675593, 45
SMILES: Fc1ccc(cc1)-c1cn(-c2ccc(OC(F)(F)F)cc2)c(=O)c2CCCNc12
InChI Key: InChIKey=LPAZMRVHEZLERF-UHFFFAOYSA-N
Data: 1 EC50
Activity Spreadsheet -- Enzyme Inhibition Constant Data from BindingDB
Found 1 hit for monomerid = 168484
Trg + Lig
Ki
nM
ΔG°
kcal/mole
IC50
nM
Kd
nM
EC50/IC50
nM
koff
s-1
kon
M-1s-1
pHTemp
°C
Endothelin-1
(Homo sapiens (Human))
BDBM168484
(US9675593, 45)
Show SMILES Fc1ccc(cc1)-c1cn(-c2ccc(OC(F)(F)F)cc2)c(=O)c2CCCNc12
Show InChI InChI=1S/C21H16F4N2O2/c22-14-5-3-13(4-6-14)18-12-27(20(28)17-2-1-11-26-19(17)18)15-7-9-16(10-8-15)29-21(23,24)25/h3-10,12,26H,1-2,11H2
US Patent
n/an/an/an/a>2.00E+5n/an/an/an/a
SRMLSC
US Patent
Assay Description
Fibroblasts (primary human lung and dermal, HFL-1, 3T3 etc) are seeded in 96-well plates at ~15000 cells/well and serum starved for 0-48 hours. After...
US Patent US9675593 (2017)
BindingDB Entry DOI: 10.7270/Q2319T24