BDBM169 (4R,5S,6S,7R)-4,7-dibenzyl-5,6-dihydroxy-3-{[3-(2-hydroxyethyl)phenyl]methyl}-1-(1H-indazol-5-ylmethyl)-1,3-diazepan-2-one::CHEMBL312358::Cyclic Urea::[4R-(4,5,6,7)]-Hexahydro-5,6-dihydroxy-1-[[3-(2-hydroxyethyl)phenyl]methyl]-3-(1H-indazol-5-ylmethyl)-4,7-bis(phenylmethyl)-2H-1,3-diazepin-2-one
SMILES: OCCc1cccc(CN2[C@H](Cc3ccccc3)[C@H](O)[C@@H](O)[C@@H](Cc3ccccc3)N(Cc3ccc4[nH]ncc4c3)C2=O)c1
InChI Key: InChIKey=PHJUBIAVEOBIMZ-WDKGQIBQSA-N
Data: 2 KI
Activity Spreadsheet -- Enzyme Inhibition Constant Data from BindingDB
Found 2 hits for monomerid = 169
Trg + Lig
Ki
nM
ΔG°
kcal/mole
IC50
nM
Kd
nM
EC50/IC50
nM
koff
s-1
kon
M-1s-1
pHTemp
°C
Human immunodeficiency virus type 1 protease
(Human immunodeficiency virus type 1)
BDBM169
((4R,5S,6S,7R)-4,7-dibenzyl-5,6-dihydroxy-3-{[3-(2-...)
Show SMILES OCCc1cccc(CN2[C@H](Cc3ccccc3)[C@H](O)[C@@H](O)[C@@H](Cc3ccccc3)N(Cc3ccc4[nH]ncc4c3)C2=O)c1
Show InChI InChI=1S/C36H38N4O4/c41-17-16-27-12-7-13-28(18-27)23-39-32(20-25-8-3-1-4-9-25)34(42)35(43)33(21-26-10-5-2-6-11-26)40(36(39)44)24-29-14-15-31-30(19-29)22-37-38-31/h1-15,18-19,22,32-35,41-43H,16-17,20-21,23-24H2,(H,37,38)/t32-,33-,34+,35+/m1/s1
0.0500n/an/an/an/an/an/an/an/a
Dupont Merck Pharmaceutical Company
Curated by ChEMBL
Assay Description
Inhibitory activity against HIV protease
J Med Chem 41: 2411-23 (1998)
Article DOI: 10.1021/jm980103g
BindingDB Entry DOI: 10.7270/Q2H41QJW
HIV-1 Protease
(Human immunodeficiency virus type 1)
BDBM169
((4R,5S,6S,7R)-4,7-dibenzyl-5,6-dihydroxy-3-{[3-(2-...)
Show SMILES OCCc1cccc(CN2[C@H](Cc3ccccc3)[C@H](O)[C@@H](O)[C@@H](Cc3ccccc3)N(Cc3ccc4[nH]ncc4c3)C2=O)c1
Show InChI InChI=1S/C36H38N4O4/c41-17-16-27-12-7-13-28(18-27)23-39-32(20-25-8-3-1-4-9-25)34(42)35(43)33(21-26-10-5-2-6-11-26)40(36(39)44)24-29-14-15-31-30(19-29)22-37-38-31/h1-15,18-19,22,32-35,41-43H,16-17,20-21,23-24H2,(H,37,38)/t32-,33-,34+,35+/m1/s1
0.0500 -14.6n/an/an/an/an/a5.537
DuPont Merck Pharmaceutical Company
Assay Description
Ki values were determined with recombinant single-chain dimeric HIV protease and a fluorescent substrate. The use of single-chain dimeric protease a...
J Med Chem 39: 3514-25 (1996)
Article DOI: 10.1021/jm9602571
BindingDB Entry DOI: 10.7270/Q2ZW1J3M