BDBM170 CHEMBL309557::Cyclic Urea::[4R-(4,5,6,7)]-Methyl 3-[[Hexahydro-5,6-dihyroxy-3-(1H-indazol-5-ylmethyl)-2-oxo-4,7-bis(phenylmethyl)-1H-1,3-diazepin-1-yl]methyl]benzeneacetate::methyl 2-(3-{[(4R,5S,6S,7R)-4,7-dibenzyl-5,6-dihydroxy-3-(1H-indazol-5-ylmethyl)-2-oxo-1,3-diazepan-1-yl]methyl}phenyl)acetate
SMILES: COC(=O)Cc1cccc(CN2[C@H](Cc3ccccc3)[C@H](O)[C@@H](O)[C@@H](Cc3ccccc3)N(Cc3ccc4[nH]ncc4c3)C2=O)c1
InChI Key: InChIKey=NFLSBSNFRZFUJE-IHIHPJAWSA-N
Data: 2 KI
Activity Spreadsheet -- Enzyme Inhibition Constant Data from BindingDB
Found 2 hits for monomerid = 170
Trg + Lig
Ki
nM
ΔG°
kcal/mole
IC50
nM
Kd
nM
EC50/IC50
nM
koff
s-1
kon
M-1s-1
pHTemp
°C
Human immunodeficiency virus type 1 protease
(Human immunodeficiency virus type 1)
BDBM170
(CHEMBL309557 | Cyclic Urea | [4R-(4,5,6,7)]-Methyl...)
Show SMILES COC(=O)Cc1cccc(CN2[C@H](Cc3ccccc3)[C@H](O)[C@@H](O)[C@@H](Cc3ccccc3)N(Cc3ccc4[nH]ncc4c3)C2=O)c1
Show InChI InChI=1S/C37H38N4O5/c1-46-34(42)21-27-13-8-14-28(17-27)23-40-32(19-25-9-4-2-5-10-25)35(43)36(44)33(20-26-11-6-3-7-12-26)41(37(40)45)24-29-15-16-31-30(18-29)22-38-39-31/h2-18,22,32-33,35-36,43-44H,19-21,23-24H2,1H3,(H,38,39)/t32-,33-,35+,36+/m1/s1
0.110n/an/an/an/an/an/an/an/a
Dupont Merck Pharmaceutical Company
Curated by ChEMBL
Assay Description
Inhibitory activity against HIV protease
J Med Chem 41: 2411-23 (1998)
Article DOI: 10.1021/jm980103g
BindingDB Entry DOI: 10.7270/Q2H41QJW
HIV-1 Protease
(Human immunodeficiency virus type 1)
BDBM170
(CHEMBL309557 | Cyclic Urea | [4R-(4,5,6,7)]-Methyl...)
Show SMILES COC(=O)Cc1cccc(CN2[C@H](Cc3ccccc3)[C@H](O)[C@@H](O)[C@@H](Cc3ccccc3)N(Cc3ccc4[nH]ncc4c3)C2=O)c1
Show InChI InChI=1S/C37H38N4O5/c1-46-34(42)21-27-13-8-14-28(17-27)23-40-32(19-25-9-4-2-5-10-25)35(43)36(44)33(20-26-11-6-3-7-12-26)41(37(40)45)24-29-15-16-31-30(18-29)22-38-39-31/h2-18,22,32-33,35-36,43-44H,19-21,23-24H2,1H3,(H,38,39)/t32-,33-,35+,36+/m1/s1
0.110 -14.1n/an/an/an/an/a5.537
DuPont Merck Pharmaceutical Company
Assay Description
Ki values were determined with recombinant single-chain dimeric HIV protease and a fluorescent substrate. The use of single-chain dimeric protease a...
J Med Chem 39: 3514-25 (1996)
Article DOI: 10.1021/jm9602571
BindingDB Entry DOI: 10.7270/Q2ZW1J3M