BDBM170064 US9073940, 422
SMILES: O=C(N1CCOCC1)c1nn([C@H]2CCCN(CCC3CCOCC3)C2)c-2c1CS(=O)(=O)c1ncccc-21
InChI Key: InChIKey=GALWNKLIQPVNFO-FQEVSTJZSA-N
Data: 1 IC50
Activity Spreadsheet -- Enzyme Inhibition Constant Data from BindingDB
Found 1 hit for monomerid = 170064
Trg + Lig
Ki
nM
ΔG°
kcal/mole
IC50
nM
Kd
nM
EC50/IC50
nM
koff
s-1
kon
M-1s-1
pHTemp
°C
Phosphoinositide 3-kinases (PI3K)
(Homo sapiens (Human))
BDBM170064
(US9073940, 422)
Show SMILES O=C(N1CCOCC1)c1nn([C@H]2CCCN(CCC3CCOCC3)C2)c-2c1CS(=O)(=O)c1ncccc-21 |r|
Show InChI InChI=1S/C26H35N5O5S/c32-26(30-11-15-36-16-12-30)23-22-18-37(33,34)25-21(4-1-8-27-25)24(22)31(28-23)20-3-2-9-29(17-20)10-5-19-6-13-35-14-7-19/h1,4,8,19-20H,2-3,5-7,9-18H2/t20-/m0/s1
US Patent
n/an/a 16n/an/an/an/an/an/a
MERCK SERONO SA
US Patent
Assay Description
The efficacy of compounds of the invention in inhibiting the PI3K induced-lipid phosphorylation may be tested in the following binding assay. The ass...
US Patent US9073940 (2015)
BindingDB Entry DOI: 10.7270/Q2ZC81N2