null
SMILES: CCc1nc(C(N)=O)c(Nc2ccc(cc2)N2CCN(C)CC2)nc1Oc1cccc(NC(=O)C=C)c1C
InChI Key: InChIKey=AEBNZKWTLCUZBW-UHFFFAOYSA-N
Activity Spreadsheet -- Enzyme Inhibition Constant Data from BindingDB
Found 2 hits for monomerid = 170475
Trg + Lig
Ki
nM
ΔG°
kcal/mole
IC50
nM
Kd
nM
EC50/IC50
nM
koff
s-1
kon
M-1s-1
pHTemp
°C
Epidermal growth factor receptor
(Homo sapiens (Human))
BDBM170475
(US9085540, 15)
Show SMILES CCc1nc(C(N)=O)c(Nc2ccc(cc2)N2CCN(C)CC2)nc1Oc1cccc(NC(=O)C=C)c1C
Show InChI InChI=1S/C28H33N7O3/c1-5-21-28(38-23-9-7-8-22(18(23)3)31-24(36)6-2)33-27(25(32-21)26(29)37)30-19-10-12-20(13-11-19)35-16-14-34(4)15-17-35/h6-13H,2,5,14-17H2,1,3-4H3,(H2,29,37)(H,30,33)(H,31,36)
US Patent
n/an/a 1.10n/an/an/an/an/an/a
Astellas Pharma Inc.
US Patent
Assay Description
The phosphorylation activity on the peptide substrate of EGFR was investigated using LabChip (trademark) Systems (Caliper Life Sciences, Inc.). For t...
US Patent US9085540 (2015)
BindingDB Entry DOI: 10.7270/Q2154FSV
Epidermal growth factor receptor
(Homo sapiens (Human))
BDBM170475
(US9085540, 15)
Show SMILES CCc1nc(C(N)=O)c(Nc2ccc(cc2)N2CCN(C)CC2)nc1Oc1cccc(NC(=O)C=C)c1C
Show InChI InChI=1S/C28H33N7O3/c1-5-21-28(38-23-9-7-8-22(18(23)3)31-24(36)6-2)33-27(25(32-21)26(29)37)30-19-10-12-20(13-11-19)35-16-14-34(4)15-17-35/h6-13H,2,5,14-17H2,1,3-4H3,(H2,29,37)(H,30,33)(H,31,36)
US Patent
n/an/a 1.20n/an/an/an/an/an/a
Astellas Pharma Inc.
US Patent
Assay Description
The phosphorylation activity on the peptide substrate of EGFR was investigated using LabChip (trademark) Systems (Caliper Life Sciences, Inc.). For t...
US Patent US9085540 (2015)
BindingDB Entry DOI: 10.7270/Q2154FSV