null
SMILES: CCc1nc(C(N)=O)c(Nc2ccc(cc2)N2CCC(CC2)N2CCN(C)CC2)nc1C1CCN(CC1)C(=O)C=C
InChI Key: InChIKey=ZBFUCVHDBVLZOQ-UHFFFAOYSA-N
Activity Spreadsheet -- Enzyme Inhibition Constant Data from BindingDB
Found 2 hits for monomerid = 170529
Trg + Lig
Ki
nM
ΔG°
kcal/mole
IC50
nM
Kd
nM
EC50/IC50
nM
koff
s-1
kon
M-1s-1
pHTemp
°C
Epidermal growth factor receptor
(Homo sapiens (Human))
BDBM170529
(US9085540, 69)
Show SMILES CCc1nc(C(N)=O)c(Nc2ccc(cc2)N2CCC(CC2)N2CCN(C)CC2)nc1C1CCN(CC1)C(=O)C=C
Show InChI InChI=1S/C31H44N8O2/c1-4-26-28(22-10-14-39(15-11-22)27(40)5-2)35-31(29(34-26)30(32)41)33-23-6-8-24(9-7-23)37-16-12-25(13-17-37)38-20-18-36(3)19-21-38/h5-9,22,25H,2,4,10-21H2,1,3H3,(H2,32,41)(H,33,35)
US Patent
n/an/a 4n/an/an/an/an/an/a
Astellas Pharma Inc.
US Patent
Assay Description
The phosphorylation activity on the peptide substrate of EGFR was investigated using LabChip (trademark) Systems (Caliper Life Sciences, Inc.). For t...
US Patent US9085540 (2015)
BindingDB Entry DOI: 10.7270/Q2154FSV
Epidermal growth factor receptor
(Homo sapiens (Human))
BDBM170529
(US9085540, 69)
Show SMILES CCc1nc(C(N)=O)c(Nc2ccc(cc2)N2CCC(CC2)N2CCN(C)CC2)nc1C1CCN(CC1)C(=O)C=C
Show InChI InChI=1S/C31H44N8O2/c1-4-26-28(22-10-14-39(15-11-22)27(40)5-2)35-31(29(34-26)30(32)41)33-23-6-8-24(9-7-23)37-16-12-25(13-17-37)38-20-18-36(3)19-21-38/h5-9,22,25H,2,4,10-21H2,1,3H3,(H2,32,41)(H,33,35)
US Patent
n/an/a 1.30n/an/an/an/an/an/a
Astellas Pharma Inc.
US Patent
Assay Description
The phosphorylation activity on the peptide substrate of EGFR was investigated using LabChip (trademark) Systems (Caliper Life Sciences, Inc.). For t...
US Patent US9085540 (2015)
BindingDB Entry DOI: 10.7270/Q2154FSV