BDBM17059 5-(2-chlorophenyl)-1-(2,6-dichlorophenyl)-7-hydroxy-1,2,3,4-tetrahydroquinazolin-2-one::Dihydro-quinazolinone analog, 8
SMILES: Oc1cc2N(C(=O)NCc2c(c1)-c1ccccc1Cl)c1c(Cl)cccc1Cl
InChI Key: InChIKey=KLSIEXRQFXOAFE-UHFFFAOYSA-N
Data: 1 IC50
Activity Spreadsheet -- Enzyme Inhibition Constant Data from BindingDB
Found 1 hit for monomerid = 17059
Trg + Lig
Ki
nM
ΔG°
kcal/mole
IC50
nM
Kd
nM
EC50/IC50
nM
koff
s-1
kon
M-1s-1
pHTemp
°C
MAP kinase p38
(Mus musculus (mouse))
BDBM17059
(5-(2-chlorophenyl)-1-(2,6-dichlorophenyl)-7-hydrox...)
Show SMILES Oc1cc2N(C(=O)NCc2c(c1)-c1ccccc1Cl)c1c(Cl)cccc1Cl
Show InChI InChI=1S/C20H13Cl3N2O2/c21-15-5-2-1-4-12(15)13-8-11(26)9-18-14(13)10-24-20(27)25(18)19-16(22)6-3-7-17(19)23/h1-9,26H,10H2,(H,24,27)
Reactome pathway
n/an/a 2n/an/an/an/a7.030
Merck Research Laboratories
Assay Description
The biochemical activity of compounds was determined by incubation with p38 enzyme, and substrates in the presence ATP/[gamma-33P] ATP. After the rea...
Bioorg Med Chem Lett 16: 4400-4 (2006)
Article DOI: 10.1016/j.bmcl.2006.05.045
BindingDB Entry DOI: 10.7270/Q2NS0S56