BDBM17061 1-(2,6-dichlorophenyl)-5-(2,4-difluorophenyl)-7-[1-(propan-2-yl)piperidin-4-yl]-1,2,3,4-tetrahydroquinazolin-2-one::Dihydro-quinazolinone analog, 10
SMILES: CC(C)N1CCC(CC1)c1cc2N(C(=O)NCc2c(c1)-c1ccc(F)cc1F)c1c(Cl)cccc1Cl
InChI Key: InChIKey=HXTBRWBQSSNSIS-UHFFFAOYSA-N
Data: 1 IC50
Activity Spreadsheet -- Enzyme Inhibition Constant Data from BindingDB
Found 1 hit for monomerid = 17061
Trg + Lig
Ki
nM
ΔG°
kcal/mole
IC50
nM
Kd
nM
EC50/IC50
nM
koff
s-1
kon
M-1s-1
pHTemp
°C
MAP kinase p38
(Mus musculus (mouse))
BDBM17061
(1-(2,6-dichlorophenyl)-5-(2,4-difluorophenyl)-7-[1...)
Show SMILES CC(C)N1CCC(CC1)c1cc2N(C(=O)NCc2c(c1)-c1ccc(F)cc1F)c1c(Cl)cccc1Cl
Show InChI InChI=1S/C28H27Cl2F2N3O/c1-16(2)34-10-8-17(9-11-34)18-12-21(20-7-6-19(31)14-25(20)32)22-15-33-28(36)35(26(22)13-18)27-23(29)4-3-5-24(27)30/h3-7,12-14,16-17H,8-11,15H2,1-2H3,(H,33,36)
Reactome pathway
n/an/a 0.200n/an/an/an/a7.030
Merck Research Laboratories
Assay Description
The biochemical activity of compounds was determined by incubation with p38 enzyme, and substrates in the presence ATP/[gamma-33P] ATP. After the rea...
Bioorg Med Chem Lett 16: 4400-4 (2006)
Article DOI: 10.1016/j.bmcl.2006.05.045
BindingDB Entry DOI: 10.7270/Q2NS0S56