BDBM17066 5-(2-chlorophenyl)-1-(2,6-dichlorophenyl)-7-(dimethylamino)-1H,2H,3H,4H-[1,3]diazino[4,5-d]pyrimidin-2-one::pyrimido-pyrimidine, 26
SMILES: CN(C)c1nc2N(C(=O)NCc2c(n1)-c1ccccc1Cl)c1c(Cl)cccc1Cl
InChI Key: InChIKey=CRZAWXHEVHSCNI-UHFFFAOYSA-N
Data: 1 IC50
Activity Spreadsheet -- Enzyme Inhibition Constant Data from BindingDB
Found 1 hit for monomerid = 17066
Trg + Lig
Ki
nM
ΔG°
kcal/mole
IC50
nM
Kd
nM
EC50/IC50
nM
koff
s-1
kon
M-1s-1
pHTemp
°C
MAP kinase p38
(Mus musculus (mouse))
BDBM17066
(5-(2-chlorophenyl)-1-(2,6-dichlorophenyl)-7-(dimet...)
Show SMILES CN(C)c1nc2N(C(=O)NCc2c(n1)-c1ccccc1Cl)c1c(Cl)cccc1Cl
Show InChI InChI=1S/C20H16Cl3N5O/c1-27(2)19-25-16(11-6-3-4-7-13(11)21)12-10-24-20(29)28(18(12)26-19)17-14(22)8-5-9-15(17)23/h3-9H,10H2,1-2H3,(H,24,29)
Reactome pathway
n/an/a 3n/an/an/an/a7.030
Merck Research Laboratories
Assay Description
The biochemical activity of compounds was determined by incubation with p38 enzyme, and substrates in the presence ATP/[gamma-33P] ATP. After the rea...
Bioorg Med Chem Lett 16: 4400-4 (2006)
Article DOI: 10.1016/j.bmcl.2006.05.045
BindingDB Entry DOI: 10.7270/Q2NS0S56