BDBM17067 5-(2-chlorophenyl)-1-(2,6-dichlorophenyl)-7-(propan-2-ylamino)-1H,2H,3H,4H-[1,3]diazino[4,5-d]pyrimidin-2-one::pyrimido-pyrimidine, 27
SMILES: CC(C)Nc1nc2N(C(=O)NCc2c(n1)-c1ccccc1Cl)c1c(Cl)cccc1Cl
InChI Key: InChIKey=PTSRDBDPYALAAJ-UHFFFAOYSA-N
Data: 1 IC50
Activity Spreadsheet -- Enzyme Inhibition Constant Data from BindingDB
Found 1 hit for monomerid = 17067
Trg + Lig
Ki
nM
ΔG°
kcal/mole
IC50
nM
Kd
nM
EC50/IC50
nM
koff
s-1
kon
M-1s-1
pHTemp
°C
MAP kinase p38
(Mus musculus (mouse))
BDBM17067
(5-(2-chlorophenyl)-1-(2,6-dichlorophenyl)-7-(propa...)
Show SMILES CC(C)Nc1nc2N(C(=O)NCc2c(n1)-c1ccccc1Cl)c1c(Cl)cccc1Cl
Show InChI InChI=1S/C21H18Cl3N5O/c1-11(2)26-20-27-17(12-6-3-4-7-14(12)22)13-10-25-21(30)29(19(13)28-20)18-15(23)8-5-9-16(18)24/h3-9,11H,10H2,1-2H3,(H,25,30)(H,26,27,28)
Reactome pathway
n/an/a 1.10n/an/an/an/a7.030
Merck Research Laboratories
Assay Description
The biochemical activity of compounds was determined by incubation with p38 enzyme, and substrates in the presence ATP/[gamma-33P] ATP. After the rea...
Bioorg Med Chem Lett 16: 4400-4 (2006)
Article DOI: 10.1016/j.bmcl.2006.05.045
BindingDB Entry DOI: 10.7270/Q2NS0S56