BDBM17070 5-(2-chlorophenyl)-1-(2,6-dichlorophenyl)-7-hydroxy-1H,2H,3H,4H-[1,3]diazino[4,5-d]pyrimidin-2-one::pyrimido-pyrimidine, 30
SMILES: Clc1ccccc1-c1nc(=O)[nH]c2N(C(=O)NCc12)c1c(Cl)cccc1Cl
InChI Key: InChIKey=YTQLAJDGTJISOD-UHFFFAOYSA-N
Data: 1 IC50
Activity Spreadsheet -- Enzyme Inhibition Constant Data from BindingDB
Found 1 hit for monomerid = 17070
Trg + Lig
Ki
nM
ΔG°
kcal/mole
IC50
nM
Kd
nM
EC50/IC50
nM
koff
s-1
kon
M-1s-1
pHTemp
°C
MAP kinase p38
(Mus musculus (mouse))
BDBM17070
(5-(2-chlorophenyl)-1-(2,6-dichlorophenyl)-7-hydrox...)
Show SMILES Clc1ccccc1-c1nc(=O)[nH]c2N(C(=O)NCc12)c1c(Cl)cccc1Cl
Show InChI InChI=1S/C18H11Cl3N4O2/c19-11-5-2-1-4-9(11)14-10-8-22-18(27)25(16(10)24-17(26)23-14)15-12(20)6-3-7-13(15)21/h1-7H,8H2,(H,22,27)(H,23,24,26)
Reactome pathway
n/an/a 4n/an/an/an/a7.030
Merck Research Laboratories
Assay Description
The biochemical activity of compounds was determined by incubation with p38 enzyme, and substrates in the presence ATP/[gamma-33P] ATP. After the rea...
Bioorg Med Chem Lett 16: 4400-4 (2006)
Article DOI: 10.1016/j.bmcl.2006.05.045
BindingDB Entry DOI: 10.7270/Q2NS0S56