BDBM17071 5-(2,4-dichlorophenyl)-1-(2,6-dichlorophenyl)-7-[(2-methoxyethyl)amino]-1H,2H,3H,4H-[1,3]diazino[4,5-d]pyrimidin-2-one::pyrimido-pyrimidine, 31
SMILES: COCCNc1nc2N(C(=O)NCc2c(n1)-c1ccc(Cl)cc1Cl)c1c(Cl)cccc1Cl
InChI Key: InChIKey=QDCOHEUEFPCTFZ-UHFFFAOYSA-N
Data: 1 IC50
Activity Spreadsheet -- Enzyme Inhibition Constant Data from BindingDB
Found 1 hit for monomerid = 17071
Trg + Lig
Ki
nM
ΔG°
kcal/mole
IC50
nM
Kd
nM
EC50/IC50
nM
koff
s-1
kon
M-1s-1
pHTemp
°C
MAP kinase p38
(Mus musculus (mouse))
BDBM17071
(5-(2,4-dichlorophenyl)-1-(2,6-dichlorophenyl)-7-[(...)
Show SMILES COCCNc1nc2N(C(=O)NCc2c(n1)-c1ccc(Cl)cc1Cl)c1c(Cl)cccc1Cl
Show InChI InChI=1S/C21H17Cl4N5O2/c1-32-8-7-26-20-28-17(12-6-5-11(22)9-16(12)25)13-10-27-21(31)30(19(13)29-20)18-14(23)3-2-4-15(18)24/h2-6,9H,7-8,10H2,1H3,(H,27,31)(H,26,28,29)
Reactome pathway
n/an/a 2n/an/an/an/a7.030
Merck Research Laboratories
Assay Description
The biochemical activity of compounds was determined by incubation with p38 enzyme, and substrates in the presence ATP/[gamma-33P] ATP. After the rea...
Bioorg Med Chem Lett 16: 4400-4 (2006)
Article DOI: 10.1016/j.bmcl.2006.05.045
BindingDB Entry DOI: 10.7270/Q2NS0S56