BDBM17072 5-(2,4-dichlorophenyl)-1-(2,6-dichlorophenyl)-7-{[2-(dimethylamino)ethyl]amino}-1H,2H,3H,4H-[1,3]diazino[4,5-d]pyrimidin-2-one::pyrimido-pyrimidine, 32
SMILES: CN(C)CCNc1nc2N(C(=O)NCc2c(n1)-c1ccc(Cl)cc1Cl)c1c(Cl)cccc1Cl
InChI Key: InChIKey=WKWWQXNWGMMYRC-UHFFFAOYSA-N
Data: 1 IC50
Activity Spreadsheet -- Enzyme Inhibition Constant Data from BindingDB
Found 1 hit for monomerid = 17072
Trg + Lig
Ki
nM
ΔG°
kcal/mole
IC50
nM
Kd
nM
EC50/IC50
nM
koff
s-1
kon
M-1s-1
pHTemp
°C
MAP kinase p38
(Mus musculus (mouse))
BDBM17072
(5-(2,4-dichlorophenyl)-1-(2,6-dichlorophenyl)-7-{[...)
Show SMILES CN(C)CCNc1nc2N(C(=O)NCc2c(n1)-c1ccc(Cl)cc1Cl)c1c(Cl)cccc1Cl
Show InChI InChI=1S/C22H20Cl4N6O/c1-31(2)9-8-27-21-29-18(13-7-6-12(23)10-17(13)26)14-11-28-22(33)32(20(14)30-21)19-15(24)4-3-5-16(19)25/h3-7,10H,8-9,11H2,1-2H3,(H,28,33)(H,27,29,30)
Reactome pathway
n/an/a 5.60n/an/an/an/a7.030
Merck Research Laboratories
Assay Description
The biochemical activity of compounds was determined by incubation with p38 enzyme, and substrates in the presence ATP/[gamma-33P] ATP. After the rea...
Bioorg Med Chem Lett 16: 4400-4 (2006)
Article DOI: 10.1016/j.bmcl.2006.05.045
BindingDB Entry DOI: 10.7270/Q2NS0S56