BDBM17073 5-(2-chlorophenyl)-1-(2,6-dichlorophenyl)-7-[2-(dimethylamino)ethoxy]-1H,2H,3H,4H-[1,3]diazino[4,5-d]pyrimidin-2-one::pyrimido-pyrimidine, 33
SMILES: CN(C)CCOc1nc2N(C(=O)NCc2c(n1)-c1ccccc1Cl)c1c(Cl)cccc1Cl
InChI Key: InChIKey=XOFKBZXMDGGJMM-UHFFFAOYSA-N
Data: 1 IC50
Activity Spreadsheet -- Enzyme Inhibition Constant Data from BindingDB
Found 1 hit for monomerid = 17073
Trg + Lig
Ki
nM
ΔG°
kcal/mole
IC50
nM
Kd
nM
EC50/IC50
nM
koff
s-1
kon
M-1s-1
pHTemp
°C
MAP kinase p38
(Mus musculus (mouse))
BDBM17073
(5-(2-chlorophenyl)-1-(2,6-dichlorophenyl)-7-[2-(di...)
Show SMILES CN(C)CCOc1nc2N(C(=O)NCc2c(n1)-c1ccccc1Cl)c1c(Cl)cccc1Cl
Show InChI InChI=1S/C22H20Cl3N5O2/c1-29(2)10-11-32-21-27-18(13-6-3-4-7-15(13)23)14-12-26-22(31)30(20(14)28-21)19-16(24)8-5-9-17(19)25/h3-9H,10-12H2,1-2H3,(H,26,31)
Reactome pathway
n/an/a 4.20n/an/an/an/a7.030
Merck Research Laboratories
Assay Description
The biochemical activity of compounds was determined by incubation with p38 enzyme, and substrates in the presence ATP/[gamma-33P] ATP. After the rea...
Bioorg Med Chem Lett 16: 4400-4 (2006)
Article DOI: 10.1016/j.bmcl.2006.05.045
BindingDB Entry DOI: 10.7270/Q2NS0S56