BDBM17074 5-(2-chlorophenyl)-1-(2,6-dichlorophenyl)-7-{4-[2-(dimethylamino)ethyl]piperazin-1-yl}-1H,2H,3H,4H-[1,3]diazino[4,5-d]pyrimidin-2-one::pyrimido-pyrimidine, 34
SMILES: CN(C)CCN1CCN(CC1)c1nc2N(C(=O)NCc2c(n1)-c1ccccc1Cl)c1c(Cl)cccc1Cl
InChI Key: InChIKey=WZAKHOAIQXFVJG-UHFFFAOYSA-N
Data: 1 IC50
Activity Spreadsheet -- Enzyme Inhibition Constant Data from BindingDB
Found 1 hit for monomerid = 17074
Trg + Lig
Ki
nM
ΔG°
kcal/mole
IC50
nM
Kd
nM
EC50/IC50
nM
koff
s-1
kon
M-1s-1
pHTemp
°C
MAP kinase p38
(Mus musculus (mouse))
BDBM17074
(5-(2-chlorophenyl)-1-(2,6-dichlorophenyl)-7-{4-[2-...)
Show SMILES CN(C)CCN1CCN(CC1)c1nc2N(C(=O)NCc2c(n1)-c1ccccc1Cl)c1c(Cl)cccc1Cl
Show InChI InChI=1S/C26H28Cl3N7O/c1-33(2)10-11-34-12-14-35(15-13-34)25-31-22(17-6-3-4-7-19(17)27)18-16-30-26(37)36(24(18)32-25)23-20(28)8-5-9-21(23)29/h3-9H,10-16H2,1-2H3,(H,30,37)
Reactome pathway
n/an/a 0.5n/an/an/an/a7.030
Merck Research Laboratories
Assay Description
The biochemical activity of compounds was determined by incubation with p38 enzyme, and substrates in the presence ATP/[gamma-33P] ATP. After the rea...
Bioorg Med Chem Lett 16: 4400-4 (2006)
Article DOI: 10.1016/j.bmcl.2006.05.045
BindingDB Entry DOI: 10.7270/Q2NS0S56