BDBM17079 5-(2,4-dichlorophenyl)-1-(2,6-dichlorophenyl)-7-[(2R,6S)-2,6-dimethylmorpholin-4-yl]-1H,2H,3H,4H-[1,3]diazino[4,5-d]pyrimidin-2-one::pyrimido-pyrimidine, 39
SMILES: C[C@H]1CN(C[C@@H](C)O1)c1nc2N(C(=O)NCc2c(n1)-c1ccc(Cl)cc1Cl)c1c(Cl)cccc1Cl
InChI Key: InChIKey=WVVPOBMLBQXERZ-BETUJISGSA-N
Data: 1 IC50
Activity Spreadsheet -- Enzyme Inhibition Constant Data from BindingDB
Found 1 hit for monomerid = 17079
Trg + Lig
Ki
nM
ΔG°
kcal/mole
IC50
nM
Kd
nM
EC50/IC50
nM
koff
s-1
kon
M-1s-1
pHTemp
°C
MAP kinase p38
(Mus musculus (mouse))
BDBM17079
(5-(2,4-dichlorophenyl)-1-(2,6-dichlorophenyl)-7-[(...)
Show SMILES C[C@H]1CN(C[C@@H](C)O1)c1nc2N(C(=O)NCc2c(n1)-c1ccc(Cl)cc1Cl)c1c(Cl)cccc1Cl |r|
Show InChI InChI=1S/C24H21Cl4N5O2/c1-12-10-32(11-13(2)35-12)23-30-20(15-7-6-14(25)8-19(15)28)16-9-29-24(34)33(22(16)31-23)21-17(26)4-3-5-18(21)27/h3-8,12-13H,9-11H2,1-2H3,(H,29,34)/t12-,13+
Reactome pathway
n/an/a 2n/an/an/an/a7.030
Merck Research Laboratories
Assay Description
The biochemical activity of compounds was determined by incubation with p38 enzyme, and substrates in the presence ATP/[gamma-33P] ATP. After the rea...
Bioorg Med Chem Lett 16: 4400-4 (2006)
Article DOI: 10.1016/j.bmcl.2006.05.045
BindingDB Entry DOI: 10.7270/Q2NS0S56