BDBM17080 7-{1-azabicyclo[2.2.2]octan-3-ylamino}-5-(2-chlorophenyl)-1-(2,6-dichlorophenyl)-1H,2H,3H,4H-[1,3]diazino[4,5-d]pyrimidin-2-one::pyrimido-pyrimidine, 40
SMILES: Clc1ccccc1-c1nc(NC2CN3CCC2CC3)nc2N(C(=O)NCc12)c1c(Cl)cccc1Cl
InChI Key: InChIKey=GVXWRVFQOVOOLI-UHFFFAOYSA-N
Data: 1 IC50
Activity Spreadsheet -- Enzyme Inhibition Constant Data from BindingDB
Found 1 hit for monomerid = 17080
Trg + Lig
Ki
nM
ΔG°
kcal/mole
IC50
nM
Kd
nM
EC50/IC50
nM
koff
s-1
kon
M-1s-1
pHTemp
°C
MAP kinase p38
(Mus musculus (mouse))
BDBM17080
(7-{1-azabicyclo[2.2.2]octan-3-ylamino}-5-(2-chloro...)
Show SMILES Clc1ccccc1-c1nc(NC2CN3CCC2CC3)nc2N(C(=O)NCc12)c1c(Cl)cccc1Cl |(1.29,-3.87,;-.05,-4.64,;-.05,-6.18,;-1.38,-6.95,;-2.71,-6.18,;-2.71,-4.64,;-1.38,-3.87,;-1.38,-2.33,;-.04,-1.57,;-.03,-.03,;1.3,.74,;2.84,.74,;3.68,1.98,;5.44,1.98,;6.41,.71,;5.48,-.48,;3.78,-.48,;5.19,.21,;4.58,.89,;-1.36,.75,;-2.7,-.01,;-4.03,.77,;-5.36,.01,;-6.69,.79,;-5.37,-1.53,;-4.05,-2.31,;-2.71,-1.55,;-4.03,2.31,;-5.36,3.08,;-6.69,2.31,;-5.36,4.62,;-4.03,5.39,;-2.69,4.62,;-2.69,3.08,;-1.36,2.31,)|
Show InChI InChI=1S/C25H23Cl3N6O/c26-17-5-2-1-4-15(17)21-16-12-29-25(35)34(22-18(27)6-3-7-19(22)28)23(16)32-24(31-21)30-20-13-33-10-8-14(20)9-11-33/h1-7,14,20H,8-13H2,(H,29,35)(H,30,31,32)
Reactome pathway
n/an/a 1.20n/an/an/an/a7.030
Merck Research Laboratories
Assay Description
The biochemical activity of compounds was determined by incubation with p38 enzyme, and substrates in the presence ATP/[gamma-33P] ATP. After the rea...
Bioorg Med Chem Lett 16: 4400-4 (2006)
Article DOI: 10.1016/j.bmcl.2006.05.045
BindingDB Entry DOI: 10.7270/Q2NS0S56