BDBM17081 5-(2-chlorophenyl)-1-(2,6-dichlorophenyl)-7-({8-methyl-8-azabicyclo[3.2.1]octan-3-yl}amino)-1H,2H,3H,4H-[1,3]diazino[4,5-d]pyrimidin-2-one::pyrimido-pyrimidine, 41
SMILES: CN1C2CCC1CC(C2)Nc1nc2N(C(=O)NCc2c(n1)-c1ccccc1Cl)c1c(Cl)cccc1Cl
InChI Key: InChIKey=XAHLKCKBXNHXNT-UHFFFAOYSA-N
Data: 1 IC50
Activity Spreadsheet -- Enzyme Inhibition Constant Data from BindingDB
Found 1 hit for monomerid = 17081
Trg + Lig
Ki
nM
ΔG°
kcal/mole
IC50
nM
Kd
nM
EC50/IC50
nM
koff
s-1
kon
M-1s-1
pHTemp
°C
MAP kinase p38
(Mus musculus (mouse))
BDBM17081
(5-(2-chlorophenyl)-1-(2,6-dichlorophenyl)-7-({8-me...)
Show SMILES CN1C2CCC1CC(C2)Nc1nc2N(C(=O)NCc2c(n1)-c1ccccc1Cl)c1c(Cl)cccc1Cl
Show InChI InChI=1S/C26H25Cl3N6O/c1-34-15-9-10-16(34)12-14(11-15)31-25-32-22(17-5-2-3-6-19(17)27)18-13-30-26(36)35(24(18)33-25)23-20(28)7-4-8-21(23)29/h2-8,14-16H,9-13H2,1H3,(H,30,36)(H,31,32,33)
Reactome pathway
n/an/a 0.5n/an/an/an/a7.030
Merck Research Laboratories
Assay Description
The biochemical activity of compounds was determined by incubation with p38 enzyme, and substrates in the presence ATP/[gamma-33P] ATP. After the rea...
Bioorg Med Chem Lett 16: 4400-4 (2006)
Article DOI: 10.1016/j.bmcl.2006.05.045
BindingDB Entry DOI: 10.7270/Q2NS0S56