BDBM171324 US9085555, 754
SMILES: CO[C@@H]1[C@@H](F)CN([C@@H]1C(=O)Nc1cccc(Br)n1)C(=O)Cn1nc(C(N)=O)c2ccccc12
InChI Key: InChIKey=NZTSVVWJDIWPPJ-YXKWSERDSA-N
Data: 1 IC50
Activity Spreadsheet -- Enzyme Inhibition Constant Data from BindingDB
Found 1 hit for monomerid = 171324
Trg + Lig
Ki
nM
ΔG°
kcal/mole
IC50
nM
Kd
nM
EC50/IC50
nM
koff
s-1
kon
M-1s-1
pHTemp
°C
Complement factor D
(Homo sapiens (Human))
BDBM171324
(US9085555, 754)
Show SMILES CO[C@@H]1[C@@H](F)CN([C@@H]1C(=O)Nc1cccc(Br)n1)C(=O)Cn1nc(C(N)=O)c2ccccc12 |r|
Show InChI InChI=1S/C21H20BrFN6O4/c1-33-19-12(23)9-28(18(19)21(32)26-15-8-4-7-14(22)25-15)16(30)10-29-13-6-3-2-5-11(13)17(27-29)20(24)31/h2-8,12,18-19H,9-10H2,1H3,(H2,24,31)(H,25,26,32)/t12-,18-,19+/m0/s1
US Patent
n/an/a 5n/an/an/an/a7.525
NOVARTIS AG
US Patent
Assay Description
Recombinant human factor D (expressed in E. coli and purified using standard methods) at 10 nM concentration is incubated with test compound at vario...
US Patent US9085555 (2015)
BindingDB Entry DOI: 10.7270/Q2RN36MP