BDBM17161 3-(4-{[3-(4-{[(2,3-dimethylphenyl)carbamoyl]amino}-3-methoxyphenyl)-2-oxo-1,2-dihydropyridin-1-yl]methyl}phenyl)propanoic acid::Pyridone derivative, 7
SMILES: COc1cc(ccc1NC(=O)Nc1cccc(C)c1C)-c1cccn(Cc2ccc(CCC(O)=O)cc2)c1=O
InChI Key: InChIKey=KOFUXMOAHAJCQT-UHFFFAOYSA-N
Data: 1 KI
Activity Spreadsheet -- Enzyme Inhibition Constant Data from BindingDB
Found 1 hit for monomerid = 17161
Trg + Lig
Ki
nM
ΔG°
kcal/mole
IC50
nM
Kd
nM
EC50/IC50
nM
koff
s-1
kon
M-1s-1
pHTemp
°C
Integrin alpha4beta1 (VLA-4)
(Homo sapiens (Human))
BDBM17161
(3-(4-{[3-(4-{[(2,3-dimethylphenyl)carbamoyl]amino}...)
Show SMILES COc1cc(ccc1NC(=O)Nc1cccc(C)c1C)-c1cccn(Cc2ccc(CCC(O)=O)cc2)c1=O
Show InChI InChI=1S/C31H31N3O5/c1-20-6-4-8-26(21(20)2)32-31(38)33-27-15-14-24(18-28(27)39-3)25-7-5-17-34(30(25)37)19-23-11-9-22(10-12-23)13-16-29(35)36/h4-12,14-15,17-18H,13,16,19H2,1-3H3,(H,35,36)(H2,32,33,38)
25.1 -10.3n/an/an/an/an/a7.522
GlaxoSmithKline
Assay Description
J6 cells (1 million cells/well) were allowed to coat wheat germ agglutinin coated SPA beads (Amersham, 1 mg/well) in assay buffer. Tritiated 3H Stand...
Bioorg Med Chem Lett 16: 5538-41 (2006)
Article DOI: 10.1016/j.bmcl.2006.08.044
BindingDB Entry DOI: 10.7270/Q24Q7S8V