null
SMILES: OCc1ccnc(c1)-n1[nH]cc(-c2cccnc2)c1=O
InChI Key: InChIKey=DVVILILDYXVNKH-UHFFFAOYSA-N
Activity Spreadsheet -- Enzyme Inhibition Constant Data from BindingDB
Found 1 hit for monomerid = 171826
Trg + Lig
Ki
nM
ΔG°
kcal/mole
IC50
nM
Kd
nM
EC50/IC50
nM
koff
s-1
kon
M-1s-1
pHTemp
°C
von Hippel-Lindau disease tumor suppressor
(Homo sapiens (Human))
BDBM171826
(US9085572, 43)
Show SMILES OCc1ccnc(c1)-n1[nH]cc(-c2cccnc2)c1=O
Show InChI InChI=1S/C14H12N4O2/c19-9-10-3-5-16-13(6-10)18-14(20)12(8-17-18)11-2-1-4-15-7-11/h1-8,17,19H,9H2
US Patent
n/an/a 1.50E+3n/an/an/an/a7.5n/a
Bayer Intellectual Property GmbH
US Patent
Assay Description
Hydroxylated HIF bonds specifically to the von Hippel-Lindau protein-elongin B-elongin C complex (VBC complex). This interaction occurs only if HIF i...
US Patent US9085572 (2015)
BindingDB Entry DOI: 10.7270/Q2H70DMQ