null
SMILES: COc1ccc2ccccc2c1-c1ccc2cc(CC(NC(=O)c3c(Cl)cccc3Cl)C(O)=O)ccc2n1
InChI Key: InChIKey=POYXPYSTVWGLAA-UHFFFAOYSA-N
Activity Spreadsheet -- Enzyme Inhibition Constant Data from BindingDB
Found 1 hit for monomerid = 17207
Trg + Lig
Ki
nM
ΔG°
kcal/mole
IC50
nM
Kd
nM
EC50/IC50
nM
koff
s-1
kon
M-1s-1
pHTemp
°C
Integrin alpha-4/beta-1 [T112H]
(Homo sapiens (Human))
BDBM17207
(2,6-quinolinyl derivative, 29 | 2-[(2,6-dichloroph...)
Show SMILES COc1ccc2ccccc2c1-c1ccc2cc(CC(NC(=O)c3c(Cl)cccc3Cl)C(O)=O)ccc2n1
Show InChI InChI=1S/C30H22Cl2N2O4/c1-38-26-14-11-18-5-2-3-6-20(18)27(26)24-13-10-19-15-17(9-12-23(19)33-24)16-25(30(36)37)34-29(35)28-21(31)7-4-8-22(28)32/h2-15,25H,16H2,1H3,(H,34,35)(H,36,37)
n/an/a 7.30n/an/an/an/a7.422
UCB
Assay Description
The VLA-4 expressing U937 cells were plated in 96-well microtiter plates, precoated with soluble human recombinant VCAM-1, in the presence of test co...
Bioorg Med Chem Lett 17: 142-6 (2007)
Article DOI: 10.1016/j.bmcl.2006.09.069
BindingDB Entry DOI: 10.7270/Q2W957FD