BDBM172418 US9090618, ZA41::US9598411, Ref. No. ZA41
SMILES: C1C[C@H]2C[C@H](C[C@@H](C1)N2[C@H]1C[C@@H]2C[C@H](C1)CCCC2)n1c(nc2ccccc12)-c1cnccn1
InChI Key: InChIKey=WZMLMMPCZNUQTR-ZWZZYCPGSA-N
Data: 2 KI
Activity Spreadsheet -- Enzyme Inhibition Constant Data from BindingDB
Found 2 hits for monomerid = 172418
Trg + Lig
Ki
nM
ΔG°
kcal/mole
IC50
nM
Kd
nM
EC50/IC50
nM
koff
s-1
kon
M-1s-1
pHTemp
°C
Nociceptin receptor
(Homo sapiens (Human))
BDBM172418
(US9090618, ZA41 | US9598411, Ref. No. ZA41)
Show SMILES C1C[C@H]2C[C@H](C[C@@H](C1)N2[C@H]1C[C@@H]2C[C@H](C1)CCCC2)n1c(nc2ccccc12)-c1cnccn1 |r,TLB:9:8:4.3.5:1.7.0|
Show InChI InChI=1S/C29H37N5/c1-2-7-21-14-20(6-1)15-24(16-21)33-22-8-5-9-23(33)18-25(17-22)34-28-11-4-3-10-26(28)32-29(34)27-19-30-12-13-31-27/h3-4,10-13,19-25H,1-2,5-9,14-18H2/t20-,21+,22-,23+,24-,25+
Reactome pathway
US Patent
1.15n/an/an/an/an/an/an/an/a
Purdue Pharma L.P.
US Patent
Assay Description
δ-Opioid Receptor Binding Assay Procedures: Radioligand dose-displacement assays used 0.2 nM [3H]-Naltrindole (NEN; 33.0 Ci/mmole) with 10-20 &#...
US Patent US9598411 (2017)
BindingDB Entry DOI: 10.7270/Q2ZG6V9S
Opioid growth factor receptor-like protein 1
(Homo sapiens (Human))
BDBM172418
(US9090618, ZA41 | US9598411, Ref. No. ZA41)
Show SMILES C1C[C@H]2C[C@H](C[C@@H](C1)N2[C@H]1C[C@@H]2C[C@H](C1)CCCC2)n1c(nc2ccccc12)-c1cnccn1 |r,TLB:9:8:4.3.5:1.7.0|
Show InChI InChI=1S/C29H37N5/c1-2-7-21-14-20(6-1)15-24(16-21)33-22-8-5-9-23(33)18-25(17-22)34-28-11-4-3-10-26(28)32-29(34)27-19-30-12-13-31-27/h3-4,10-13,19-25H,1-2,5-9,14-18H2/t20-,21+,22-,23+,24-,25+
US Patent
1.15 -12.2n/an/an/an/an/a7.425
Purdue Pharma L.P.
US Patent
Assay Description
Radioligand binding assays (screening and dose-displacement) used 0.1 nM [3H]-nociceptin (NEN; 87.7 Ci/mmole) with 10-20 ug membrane protein in a fin...
US Patent US9090618 (2015)
BindingDB Entry DOI: 10.7270/Q2G73CGB