null
SMILES: CCn1ccc2c1c(cn(-c1ccc(OC(F)(F)F)cc1)c2=O)-c1ccc(F)cc1
InChI Key: InChIKey=JVAXPNYIPZEBSO-UHFFFAOYSA-N
Activity Spreadsheet -- Enzyme Inhibition Constant Data from BindingDB
Found 1 hit for monomerid = 172575
Trg + Lig
Ki
nM
ΔG°
kcal/mole
IC50
nM
Kd
nM
EC50/IC50
nM
koff
s-1
kon
M-1s-1
pHTemp
°C
Endothelin-1
(Homo sapiens (Human))
BDBM172575
(US9675593, 626)
Show SMILES CCn1ccc2c1c(cn(-c1ccc(OC(F)(F)F)cc1)c2=O)-c1ccc(F)cc1
Show InChI InChI=1S/C22H16F4N2O2/c1-2-27-12-11-18-20(27)19(14-3-5-15(23)6-4-14)13-28(21(18)29)16-7-9-17(10-8-16)30-22(24,25)26/h3-13H,2H2,1H3
US Patent
n/an/an/an/a<5.00E+4n/an/an/an/a
SRMLSC
US Patent
Assay Description
Fibroblasts (primary human lung and dermal, HFL-1, 3T3 etc) are seeded in 96-well plates at ~15000 cells/well and serum starved for 0-48 hours. After...
US Patent US9675593 (2017)
BindingDB Entry DOI: 10.7270/Q2319T24