BDBM172707 US9090628, 367
SMILES: CC(C)[C@@H]1CN(CCN1C)c1c(cnn1C)-c1ccc2-c3nc(cn3CCOc2c1)-c1nc(C)nn1C(C)C
InChI Key: InChIKey=PGXUWTLJGWBYGR-VWLOTQADSA-N
Data: 1 IC50
Activity Spreadsheet -- Enzyme Inhibition Constant Data from BindingDB
Found 1 hit for monomerid = 172707
Trg + Lig
Ki
nM
ΔG°
kcal/mole
IC50
nM
Kd
nM
EC50/IC50
nM
koff
s-1
kon
M-1s-1
pHTemp
°C
Phosphatidylinositol 4,5-bisphosphate 3-kinase catalytic subunit delta isoform
(Homo sapiens (Human))
BDBM172707
(US9090628, 367)
Show SMILES CC(C)[C@@H]1CN(CCN1C)c1c(cnn1C)-c1ccc2-c3nc(cn3CCOc2c1)-c1nc(C)nn1C(C)C |r|
Show InChI InChI=1S/C29H39N9O/c1-18(2)25-17-37(11-10-34(25)6)29-23(15-30-35(29)7)21-8-9-22-26(14-21)39-13-12-36-16-24(32-27(22)36)28-31-20(5)33-38(28)19(3)4/h8-9,14-16,18-19,25H,10-13,17H2,1-7H3/t25-/m0/s1
NCI pathway
Reactome pathway
US Patent
n/an/a 0.0480n/an/an/an/a7.5n/a
GENENTECH, INC.
US Patent
Assay Description
PI3K enzymatic activity was assayed by measuring the amount of product phosphatidylinositol 3,4,5-phosphate (PIP3) formed from substrate 4,5 phosphat...
US Patent US9090628 (2015)
BindingDB Entry DOI: 10.7270/Q26Q1W0V