null
SMILES: CC(C)C(=O)NCc1ccc(cc1)C(=O)Nc1cc(ccc1N)-c1cccs1
InChI Key: InChIKey=GVRDQKDHYHMHHL-UHFFFAOYSA-N
Activity Spreadsheet -- Enzyme Inhibition Constant Data from BindingDB
Found 1 hit for monomerid = 172806
Trg + Lig
Ki
nM
ΔG°
kcal/mole
IC50
nM
Kd
nM
EC50/IC50
nM
koff
s-1
kon
M-1s-1
pHTemp
°C
Histone deacetylase 1
(Homo sapiens (Human))
BDBM172806
(US9096559, 40)
Show SMILES CC(C)C(=O)NCc1ccc(cc1)C(=O)Nc1cc(ccc1N)-c1cccs1
Show InChI InChI=1S/C22H23N3O2S/c1-14(2)21(26)24-13-15-5-7-16(8-6-15)22(27)25-19-12-17(9-10-18(19)23)20-4-3-11-28-20/h3-12,14H,13,23H2,1-2H3,(H,24,26)(H,25,27)
NCI pathway
Reactome pathway
US Patent
n/an/a 16n/an/an/an/an/an/a
Merck Sharp & Dohme Corp.
US Patent
Assay Description
Novel compounds were tested for their ability to inhibit histone deacetylase, subtype 1 (HDAC1) using an in vitro deacetylation assay. The enzyme sou...
US Patent US9096559 (2015)
BindingDB Entry DOI: 10.7270/Q2K07317