BDBM172820 US9096559, 55
SMILES: Nc1ccc(cc1NC(=O)c1ccc(CNC(=O)Cc2ccncc2)cc1)-c1cccs1
InChI Key: InChIKey=SYNRENXFZSJTTQ-UHFFFAOYSA-N
Data: 1 IC50
Activity Spreadsheet -- Enzyme Inhibition Constant Data from BindingDB
Found 1 hit for monomerid = 172820
Trg + Lig
Ki
nM
ΔG°
kcal/mole
IC50
nM
Kd
nM
EC50/IC50
nM
koff
s-1
kon
M-1s-1
pHTemp
°C
Histone deacetylase 1
(Homo sapiens (Human))
BDBM172820
(US9096559, 55)
Show SMILES Nc1ccc(cc1NC(=O)c1ccc(CNC(=O)Cc2ccncc2)cc1)-c1cccs1
Show InChI InChI=1S/C25H22N4O2S/c26-21-8-7-20(23-2-1-13-32-23)15-22(21)29-25(31)19-5-3-18(4-6-19)16-28-24(30)14-17-9-11-27-12-10-17/h1-13,15H,14,16,26H2,(H,28,30)(H,29,31)
NCI pathway
Reactome pathway
US Patent
n/an/a 18n/an/an/an/an/an/a
Merck Sharp & Dohme Corp.
US Patent
Assay Description
Novel compounds were tested for their ability to inhibit histone deacetylase, subtype 1 (HDAC1) using an in vitro deacetylation assay. The enzyme sou...
US Patent US9096559 (2015)
BindingDB Entry DOI: 10.7270/Q2K07317