BDBM172828 US9096559, 64
SMILES: CNCCCN(C)Cc1ccc(cc1)C(=O)Nc1cc(ccc1N)-c1ccccc1
InChI Key: InChIKey=KROJYNLFDGGCOY-UHFFFAOYSA-N
Data: 1 IC50
Activity Spreadsheet -- Enzyme Inhibition Constant Data from BindingDB
Found 1 hit for monomerid = 172828
Trg + Lig
Ki
nM
ΔG°
kcal/mole
IC50
nM
Kd
nM
EC50/IC50
nM
koff
s-1
kon
M-1s-1
pHTemp
°C
Histone deacetylase 1
(Homo sapiens (Human))
BDBM172828
(US9096559, 64)
Show SMILES CNCCCN(C)Cc1ccc(cc1)C(=O)Nc1cc(ccc1N)-c1ccccc1
Show InChI InChI=1S/C25H30N4O/c1-27-15-6-16-29(2)18-19-9-11-21(12-10-19)25(30)28-24-17-22(13-14-23(24)26)20-7-4-3-5-8-20/h3-5,7-14,17,27H,6,15-16,18,26H2,1-2H3,(H,28,30)
NCI pathway
Reactome pathway
US Patent
n/an/a 18n/an/an/an/an/an/a
Merck Sharp & Dohme Corp.
US Patent
Assay Description
Novel compounds were tested for their ability to inhibit histone deacetylase, subtype 1 (HDAC1) using an in vitro deacetylation assay. The enzyme sou...
US Patent US9096559 (2015)
BindingDB Entry DOI: 10.7270/Q2K07317