null
SMILES: Cc1cc(Nc2nccc(n2)-c2cn(C)cn2)cc2cc([nH]c12)C(=O)NCc1cscn1
InChI Key: InChIKey=FRFHONUXFRASIE-UHFFFAOYSA-N
Activity Spreadsheet -- Enzyme Inhibition Constant Data from BindingDB
Found 1 hit for monomerid = 173017
Trg + Lig
Ki
nM
ΔG°
kcal/mole
IC50
nM
Kd
nM
EC50/IC50
nM
koff
s-1
kon
M-1s-1
pHTemp
°C
Tyrosine-protein kinase SYK
(Homo sapiens (Human))
BDBM173017
(US9096579, 119)
Show SMILES Cc1cc(Nc2nccc(n2)-c2cn(C)cn2)cc2cc([nH]c12)C(=O)NCc1cscn1
Show InChI InChI=1S/C22H20N8OS/c1-13-5-15(27-22-23-4-3-17(29-22)19-9-30(2)11-25-19)6-14-7-18(28-20(13)14)21(31)24-8-16-10-32-12-26-16/h3-7,9-12,28H,8H2,1-2H3,(H,24,31)(H,23,27,29)
NCI pathway
Reactome pathway
US Patent
n/an/a 9.20n/an/an/an/an/an/a
Boehringer Ingelheim International GmbH
US Patent
Assay Description
Recombinant human Syk (amino acids 342-635) was expressed as a fusion protein with an N-terminal GST tag, affinity-purified and deep-frozen at a conc...
US Patent US9096579 (2015)
BindingDB Entry DOI: 10.7270/Q2F76B9H