null
SMILES: CCOc1ccc(c(C)c1)-n1cc(-c2cnn(C)c2)c(NCc2cc(F)cc(F)c2)cc1=O
InChI Key: InChIKey=KFORIMWOOIXPMS-UHFFFAOYSA-N
Activity Spreadsheet -- Enzyme Inhibition Constant Data from BindingDB
Found 1 hit for monomerid = 173075
Trg + Lig
Ki
nM
ΔG°
kcal/mole
IC50
nM
Kd
nM
EC50/IC50
nM
koff
s-1
kon
M-1s-1
pHTemp
°C
Endothelin-1
(Homo sapiens (Human))
BDBM173075
(US9675593, 703)
Show SMILES CCOc1ccc(c(C)c1)-n1cc(-c2cnn(C)c2)c(NCc2cc(F)cc(F)c2)cc1=O
Show InChI InChI=1S/C25H24F2N4O2/c1-4-33-21-5-6-24(16(2)7-21)31-15-22(18-13-29-30(3)14-18)23(11-25(31)32)28-12-17-8-19(26)10-20(27)9-17/h5-11,13-15,28H,4,12H2,1-3H3
US Patent
n/an/an/an/a<5.00E+4n/an/an/an/a
SRMLSC
US Patent
Assay Description
Fibroblasts (primary human lung and dermal, HFL-1, 3T3 etc) are seeded in 96-well plates at ~15000 cells/well and serum starved for 0-48 hours. After...
US Patent US9675593 (2017)
BindingDB Entry DOI: 10.7270/Q2319T24