BDBM173117 US9096589, 2-{(E)-2-[4-Furan-2-yl-1-(2-trimethylsilanyl-ethoxymethyl)-1H-imidazol-2-yl]-vinyl}-5-methyl-[1,2,4]triazolo[1,5-a]pyridine
SMILES: Cc1cccc2nc(\C=C\c3nc(cn3COCC[Si](C)(C)C)-c3ccco3)nn12
InChI Key: InChIKey=XGNPYGXVMOBKPP-ZHACJKMWSA-N
Data: 1 IC50
Activity Spreadsheet -- Enzyme Inhibition Constant Data from BindingDB
Found 1 hit for monomerid = 173117
Trg + Lig
Ki
nM
ΔG°
kcal/mole
IC50
nM
Kd
nM
EC50/IC50
nM
koff
s-1
kon
M-1s-1
pHTemp
°C
cAMP and cAMP-inhibited cGMP 3',5'-cyclic phosphodiesterase 10A
(Homo sapiens (Human))
BDBM173117
(US9096589, 2-{(E)-2-[4-Furan-2-yl-1-(2-trimethylsi...)
Show SMILES Cc1cccc2nc(\C=C\c3nc(cn3COCC[Si](C)(C)C)-c3ccco3)nn12
Show InChI InChI=1S/C22H27N5O2Si/c1-17-7-5-9-22-24-20(25-27(17)22)10-11-21-23-18(19-8-6-12-29-19)15-26(21)16-28-13-14-30(2,3)4/h5-12,15H,13-14,16H2,1-4H3/b11-10+
Reactome pathway
US Patent
n/an/a 46n/an/an/an/an/a25
H. Lundbeck A/S
US Patent
Assay Description
A PDE10A assay may for example, be performed as follows: The assay is performed in 60 uL samples containing a fixed amount of the relevant PDE enzyme...
US Patent US9096589 (2015)
BindingDB Entry DOI: 10.7270/Q25Q4TTM