BDBM173154 US9096589, (S)-1-(Isopropyl-methyl-amino)-3-{2-[2-(5-methyl-[1,2,4]triazolo[1,5-a]pyridin-2-yl)-ethyl]-4-thiophen-2-yl-imidazol-1-yl}-propan-2-ol
SMILES: CC(C)N(C)C[C@H](O)Cn1cc(nc1CCc1nc2cccc(C)n2n1)-c1cccs1
InChI Key: InChIKey=CKSSPJUGIMRTHN-SFHVURJKSA-N
Data: 1 IC50
Activity Spreadsheet -- Enzyme Inhibition Constant Data from BindingDB
Found 1 hit for monomerid = 173154
Trg + Lig
Ki
nM
ΔG°
kcal/mole
IC50
nM
Kd
nM
EC50/IC50
nM
koff
s-1
kon
M-1s-1
pHTemp
°C
cAMP and cAMP-inhibited cGMP 3',5'-cyclic phosphodiesterase 10A
(Homo sapiens (Human))
BDBM173154
(US9096589, (S)-1-(Isopropyl-methyl-amino)-3-{2-[2-...)
Show SMILES CC(C)N(C)C[C@H](O)Cn1cc(nc1CCc1nc2cccc(C)n2n1)-c1cccs1
Show InChI InChI=1S/C23H30N6OS/c1-16(2)27(4)13-18(30)14-28-15-19(20-8-6-12-31-20)24-22(28)11-10-21-25-23-9-5-7-17(3)29(23)26-21/h5-9,12,15-16,18,30H,10-11,13-14H2,1-4H3/t18-/m0/s1
Reactome pathway
US Patent
n/an/a 97n/an/an/an/an/a25
H. Lundbeck A/S
US Patent
Assay Description
A PDE10A assay may for example, be performed as follows: The assay is performed in 60 uL samples containing a fixed amount of the relevant PDE enzyme...
US Patent US9096589 (2015)
BindingDB Entry DOI: 10.7270/Q25Q4TTM