BDBM173188 US9096589, 8-Methoxy-5-methyl-2-{2-[1-methyl-4-(5-methyl-furan-2-yl)-1H-imidazol-2-yl]-ethyl}-[1,2,4]triazolo[1,5-a]pyridine
SMILES: COc1ccc(C)n2nc(CCc3nc(cn3C)-c3ccc(C)o3)nc12
InChI Key: InChIKey=PWJGLZROQXJBOI-UHFFFAOYSA-N
Data: 1 IC50
Activity Spreadsheet -- Enzyme Inhibition Constant Data from BindingDB
Found 1 hit for monomerid = 173188
Trg + Lig
Ki
nM
ΔG°
kcal/mole
IC50
nM
Kd
nM
EC50/IC50
nM
koff
s-1
kon
M-1s-1
pHTemp
°C
cAMP and cAMP-inhibited cGMP 3',5'-cyclic phosphodiesterase 10A
(Homo sapiens (Human))
BDBM173188
(US9096589, 8-Methoxy-5-methyl-2-{2-[1-methyl-4-(5-...)
Show SMILES COc1ccc(C)n2nc(CCc3nc(cn3C)-c3ccc(C)o3)nc12
Show InChI InChI=1S/C19H21N5O2/c1-12-5-7-16(25-4)19-21-17(22-24(12)19)9-10-18-20-14(11-23(18)3)15-8-6-13(2)26-15/h5-8,11H,9-10H2,1-4H3
Reactome pathway
US Patent
n/an/a 20n/an/an/an/an/a25
H. Lundbeck A/S
US Patent
Assay Description
A PDE10A assay may for example, be performed as follows: The assay is performed in 60 uL samples containing a fixed amount of the relevant PDE enzyme...
US Patent US9096589 (2015)
BindingDB Entry DOI: 10.7270/Q25Q4TTM