BDBM174100 US9688669, Example 3
SMILES: CCCCC#Cc1cncc(c1)[C@H]1NC(=O)O[C@@H]1c1cccc(F)c1
InChI Key: InChIKey=KPJLQIOSDDYBLF-RTBURBONSA-N
Data: 1 EC50
Activity Spreadsheet -- Enzyme Inhibition Constant Data from BindingDB
Found 1 hit for monomerid = 174100
Trg + Lig
Ki
nM
ΔG°
kcal/mole
IC50
nM
Kd
nM
EC50/IC50
nM
koff
s-1
kon
M-1s-1
pHTemp
°C
Metabotropic glutamate receptor 5 (mGluR5)
(Homo sapiens (Human))
BDBM174100
(US9688669, Example 3)
Show SMILES CCCCC#Cc1cncc(c1)[C@H]1NC(=O)O[C@@H]1c1cccc(F)c1 |r|
Show InChI InChI=1S/C20H19FN2O2/c1-2-3-4-5-7-14-10-16(13-22-12-14)18-19(25-20(24)23-18)15-8-6-9-17(21)11-15/h6,8-13,18-19H,2-4H2,1H3,(H,23,24)/t18-,19-/m1/s1
US Patent
n/an/an/an/a 2.20n/an/an/an/a
Bristol-Myers Squibb Company
US Patent
Assay Description
HEK293 (ZF) cells stably transfected with human mGluR5A (pIRES neo) and the rat glutamate-aspartate transporter (GLAST; pIRES puro) are grown in a mo...
US Patent US9688669 (2017)
BindingDB Entry DOI: 10.7270/Q25T3HN9