BDBM174135 US9688669, Example 11
SMILES: Fc1cccc(c1)[C@H]1OC(=O)N[C@@H]1c1cncc(c1)C#CCC1CCOCC1
InChI Key: InChIKey=BRBLYHMJUGEODQ-NHCUHLMSSA-N
Data: 1 EC50
Activity Spreadsheet -- Enzyme Inhibition Constant Data from BindingDB
Found 1 hit for monomerid = 174135
Trg + Lig
Ki
nM
ΔG°
kcal/mole
IC50
nM
Kd
nM
EC50/IC50
nM
koff
s-1
kon
M-1s-1
pHTemp
°C
Metabotropic glutamate receptor 5 (mGluR5)
(Homo sapiens (Human))
BDBM174135
(US9688669, Example 11)
Show SMILES Fc1cccc(c1)[C@H]1OC(=O)N[C@@H]1c1cncc(c1)C#CCC1CCOCC1 |r|
Show InChI InChI=1S/C22H21FN2O3/c23-19-6-2-5-17(12-19)21-20(25-22(26)28-21)18-11-16(13-24-14-18)4-1-3-15-7-9-27-10-8-15/h2,5-6,11-15,20-21H,3,7-10H2,(H,25,26)/t20-,21-/m1/s1
US Patent
n/an/an/an/a 14n/an/an/an/a
Bristol-Myers Squibb Company
US Patent
Assay Description
HEK293 (ZF) cells stably transfected with human mGluR5A (pIRES neo) and the rat glutamate-aspartate transporter (GLAST; pIRES puro) are grown in a mo...
US Patent US9688669 (2017)
BindingDB Entry DOI: 10.7270/Q25T3HN9