BDBM174195 US9688669, Example 51
SMILES: CCCCCC#Cc1cncc(c1)[C@H]1NC(=O)O[C@@H]1c1cccc(F)c1
InChI Key: InChIKey=IZAOIEHCTZNVFB-WOJBJXKFSA-N
Data: 1 EC50
Activity Spreadsheet -- Enzyme Inhibition Constant Data from BindingDB
Found 1 hit for monomerid = 174195
Trg + Lig
Ki
nM
ΔG°
kcal/mole
IC50
nM
Kd
nM
EC50/IC50
nM
koff
s-1
kon
M-1s-1
pHTemp
°C
Metabotropic glutamate receptor 5 (mGluR5)
(Homo sapiens (Human))
BDBM174195
(US9688669, Example 51)
Show SMILES CCCCCC#Cc1cncc(c1)[C@H]1NC(=O)O[C@@H]1c1cccc(F)c1 |r|
Show InChI InChI=1S/C21H21FN2O2/c1-2-3-4-5-6-8-15-11-17(14-23-13-15)19-20(26-21(25)24-19)16-9-7-10-18(22)12-16/h7,9-14,19-20H,2-5H2,1H3,(H,24,25)/t19-,20-/m1/s1
US Patent
n/an/an/an/a 8.10n/an/an/an/a
Bristol-Myers Squibb Company
US Patent
Assay Description
HEK293 (ZF) cells stably transfected with human mGluR5A (pIRES neo) and the rat glutamate-aspartate transporter (GLAST; pIRES puro) are grown in a mo...
US Patent US9688669 (2017)
BindingDB Entry DOI: 10.7270/Q25T3HN9