BDBM1742 2-Amino-6-arylthiobenzonitrile deriv. 1l::2-amino-6-[(3-bromophenyl)sulfanyl]benzonitrile
SMILES: Nc1cccc(Sc2cccc(Br)c2)c1C#N
InChI Key: InChIKey=DAHSRCREKZVLOW-UHFFFAOYSA-N
Data: 4 IC50
Activity Spreadsheet -- Enzyme Inhibition Constant Data from BindingDB
Found 4 hits for monomerid = 1742
Trg + Lig
Ki
nM
ΔG°
kcal/mole
IC50
nM
Kd
nM
EC50/IC50
nM
koff
s-1
kon
M-1s-1
pHTemp
°C
HIV-1 Reverse Transcriptase
(Human immunodeficiency virus type 1)
BDBM1742
(2-Amino-6-arylthiobenzonitrile deriv. 1l | 2-amino...)
Show SMILES Nc1cccc(Sc2cccc(Br)c2)c1C#N
Show InChI InChI=1S/C13H9BrN2S/c14-9-3-1-4-10(7-9)17-13-6-2-5-12(16)11(13)8-15/h1-7H,16H2
n/an/a 1.50E+4n/an/an/an/a8.0n/a
GlaxoSmithKline
Assay Description
The IC50 of reverse transcriptase is the concentration that inhibits 50% of recombinant HIV-1 RT RNA-directed DNA polymerase activity in vitro.
J Med Chem 44: 1866-82 (2001)
Article DOI: 10.1021/jm0004906
BindingDB Entry DOI: 10.7270/Q2FJ2F09
Reverse transcriptase
(Human immunodeficiency virus 1)
BDBM1742
(2-Amino-6-arylthiobenzonitrile deriv. 1l | 2-amino...)
Show SMILES Nc1cccc(Sc2cccc(Br)c2)c1C#N
Show InChI InChI=1S/C13H9BrN2S/c14-9-3-1-4-10(7-9)17-13-6-2-5-12(16)11(13)8-15/h1-7H,16H2
n/an/a 1.51E+4n/an/an/an/an/an/a
TBA
Assay Description
Inhibition of HIV-1 reverse transcriptase
Citation and Details
Article DOI: 10.1007/s00044-013-0765-3
BindingDB Entry DOI: 10.7270/Q2W66PQQ
Reverse transcriptase
(Human immunodeficiency virus 1)
BDBM1742
(2-Amino-6-arylthiobenzonitrile deriv. 1l | 2-amino...)
Show SMILES Nc1cccc(Sc2cccc(Br)c2)c1C#N
Show InChI InChI=1S/C13H9BrN2S/c14-9-3-1-4-10(7-9)17-13-6-2-5-12(16)11(13)8-15/h1-7H,16H2
n/an/a 1.50E+7n/an/an/an/an/an/a
Lanzhou University
Curated by ChEMBL
Assay Description
Inhibition of HIV1 reverse transcriptase
Eur J Med Chem 44: 2158-71 (2009)
Article DOI: 10.1016/j.ejmech.2008.10.021
BindingDB Entry DOI: 10.7270/Q21R6T9R
Human immunodeficiency virus type 1 reverse transcriptase
(Human immunodeficiency virus 1)
BDBM1742
(2-Amino-6-arylthiobenzonitrile deriv. 1l | 2-amino...)
Show SMILES Nc1cccc(Sc2cccc(Br)c2)c1C#N
Show InChI InChI=1S/C13H9BrN2S/c14-9-3-1-4-10(7-9)17-13-6-2-5-12(16)11(13)8-15/h1-7H,16H2
n/an/a 1.51E+4n/an/an/an/an/an/a
University of Perugia
Curated by ChEMBL
Assay Description
Inhibitory concentration against Reverse transcriptase
J Med Chem 48: 3756-67 (2005)
Article DOI: 10.1021/jm049162m
BindingDB Entry DOI: 10.7270/Q2XS5WQ0