BDBM175517 US9119845, 18
SMILES: OC[C@@H]1[C@@H](O)[C@H](O)CCN1Cc1cccs1
InChI Key: InChIKey=ISAOYVIHYXORAH-GMTAPVOTSA-N
Data: 1 KI  1 IC50  1 EC50
Activity Spreadsheet -- Enzyme Inhibition Constant Data from BindingDB
Found 1 hit for monomerid = 175517
Trg + Lig
Ki
nM
ΔG°
kcal/mole
IC50
nM
Kd
nM
EC50/IC50
nM
koff
s-1
kon
M-1s-1
pHTemp
°C
Beta-glucocerebrosidase
(Mus musculus (Mouse))
BDBM175517
(US9119845, 18)
Show SMILES OC[C@@H]1[C@@H](O)[C@H](O)CCN1Cc1cccs1 |r|
Show InChI InChI=1S/C11H17NO3S/c13-7-9-11(15)10(14)3-4-12(9)6-8-2-1-5-16-8/h1-2,5,9-11,13-15H,3-4,6-7H2/t9-,10-,11-/m1/s1
US Patent
1.14E+4n/a 2.76E+4n/a 1.39E+5n/an/a4.5n/a
Amicus Therapeautics, Inc.
US Patent
Assay Description
To 2.5 μl of supernatant (in 96-well plates) was added 17.5 μl reaction buffer (citrate phosphate buffer, pH 4.5, no Triton X-100), and 50 ...
US Patent US9119845 (2015)
BindingDB Entry DOI: 10.7270/Q2V40T0P