BDBM175522 US9119845, 23
SMILES: OC[C@@H]1[C@@H](O)[C@H](O)CCN1CC1CCCC1
InChI Key: InChIKey=YMJQGMYJUACLOH-IJLUTSLNSA-N
Data: 1 KI  1 IC50  1 EC50
Activity Spreadsheet -- Enzyme Inhibition Constant Data from BindingDB
Found 1 hit for monomerid = 175522
Trg + Lig
Ki
nM
ΔG°
kcal/mole
IC50
nM
Kd
nM
EC50/IC50
nM
koff
s-1
kon
M-1s-1
pHTemp
°C
Beta-glucocerebrosidase
(Mus musculus (Mouse))
BDBM175522
(US9119845, 23)
Show SMILES OC[C@@H]1[C@@H](O)[C@H](O)CCN1CC1CCCC1 |r|
Show InChI InChI=1S/C12H23NO3/c14-8-10-12(16)11(15)5-6-13(10)7-9-3-1-2-4-9/h9-12,14-16H,1-8H2/t10-,11-,12-/m1/s1
US Patent
6.48E+3n/a 1.56E+4n/a 1.88E+4n/an/a4.5n/a
Amicus Therapeautics, Inc.
US Patent
Assay Description
To 2.5 μl of supernatant (in 96-well plates) was added 17.5 μl reaction buffer (citrate phosphate buffer, pH 4.5, no Triton X-100), and 50 ...
US Patent US9119845 (2015)
BindingDB Entry DOI: 10.7270/Q2V40T0P