BDBM17597 2-[(4-chlorobenzene)sulfonamido]-5-methylbenzoic acid::sulfonamide compound, 3
SMILES: Cc1ccc(NS(=O)(=O)c2ccc(Cl)cc2)c(c1)C(O)=O
InChI Key: InChIKey=KZILFSJXWYKWMG-UHFFFAOYSA-N
Data: 1 IC50
Activity Spreadsheet -- Enzyme Inhibition Constant Data from BindingDB
Found 1 hit for monomerid = 17597
Trg + Lig
Ki
nM
ΔG°
kcal/mole
IC50
nM
Kd
nM
EC50/IC50
nM
koff
s-1
kon
M-1s-1
pHTemp
°C
Methionine aminopeptidase 2
(Homo sapiens (Human))
BDBM17597
(2-[(4-chlorobenzene)sulfonamido]-5-methylbenzoic a...)
Show SMILES Cc1ccc(NS(=O)(=O)c2ccc(Cl)cc2)c(c1)C(O)=O
Show InChI InChI=1S/C14H12ClNO4S/c1-9-2-7-13(12(8-9)14(17)18)16-21(19,20)11-5-3-10(15)4-6-11/h2-8,16H,1H3,(H,17,18)
Reactome pathway
n/an/a 1.10E+4n/an/an/an/a7.422
Abbott Laboratories
Assay Description
A coupled enzyme chromogenic assay was developed to measure methionine aminopeptidase-2 activity by monitoring the production of free methionine with...
Bioorg Med Chem Lett 16: 3574-7 (2006)
Article DOI: 10.1016/j.bmcl.2006.03.085
BindingDB Entry DOI: 10.7270/Q2TB1556