BDBM17603 2-benzenesulfonamidonaphthalene-1-carboxylic acid::sulfonamide compound, 9
SMILES: OC(=O)c1c(NS(=O)(=O)c2ccccc2)ccc2ccccc12
InChI Key: InChIKey=CXPIFTCBANXJNX-UHFFFAOYSA-N
Data: 1 IC50
Activity Spreadsheet -- Enzyme Inhibition Constant Data from BindingDB
Found 1 hit for monomerid = 17603
Trg + Lig
Ki
nM
ΔG°
kcal/mole
IC50
nM
Kd
nM
EC50/IC50
nM
koff
s-1
kon
M-1s-1
pHTemp
°C
Methionine aminopeptidase 2
(Homo sapiens (Human))
BDBM17603
(2-benzenesulfonamidonaphthalene-1-carboxylic acid ...)
Show SMILES OC(=O)c1c(NS(=O)(=O)c2ccccc2)ccc2ccccc12
Show InChI InChI=1S/C17H13NO4S/c19-17(20)16-14-9-5-4-6-12(14)10-11-15(16)18-23(21,22)13-7-2-1-3-8-13/h1-11,18H,(H,19,20)
Reactome pathway
n/an/a 19n/an/an/an/a7.422
Abbott Laboratories
Assay Description
A coupled enzyme chromogenic assay was developed to measure methionine aminopeptidase-2 activity by monitoring the production of free methionine with...
Bioorg Med Chem Lett 16: 3574-7 (2006)
Article DOI: 10.1016/j.bmcl.2006.03.085
BindingDB Entry DOI: 10.7270/Q2TB1556