null
SMILES: COc1nc(NCCc2ccc(F)cc2)nc(n1)-c1cc2ccccc2s1
InChI Key: InChIKey=PBYCGHARSQYKRC-UHFFFAOYSA-N
Activity Spreadsheet -- Enzyme Inhibition Constant Data from BindingDB
Found 1 hit for monomerid = 176654
Trg + Lig
Ki
nM
ΔG°
kcal/mole
IC50
nM
Kd
nM
EC50/IC50
nM
koff
s-1
kon
M-1s-1
pHTemp
°C
Cannabinoid receptor 2
(Homo sapiens (Human))
BDBM176654
(US9115121, 47)
Show SMILES COc1nc(NCCc2ccc(F)cc2)nc(n1)-c1cc2ccccc2s1
Show InChI InChI=1S/C20H17FN4OS/c1-26-20-24-18(17-12-14-4-2-3-5-16(14)27-17)23-19(25-20)22-11-10-13-6-8-15(21)9-7-13/h2-9,12H,10-11H2,1H3,(H,22,23,24,25)
Reactome pathway
US Patent
n/an/a 4n/an/an/an/an/an/a
Sanofi
US Patent
Assay Description
Affinity binding tests were performed according to the experimental conditions described by M. Rinaldi-Carmona in J. Pharmacol. Exp. Therap. 1998, 28...
US Patent US9115121 (2015)
BindingDB Entry DOI: 10.7270/Q23N225X