null
SMILES: COc1nc(NCCc2ccc(F)cc2)nc(n1)-c1ccc(CO)c(c1)S(=O)(=O)NC1CC1
InChI Key: InChIKey=MNVBRBXCQZDFJZ-UHFFFAOYSA-N
Activity Spreadsheet -- Enzyme Inhibition Constant Data from BindingDB
Found 1 hit for monomerid = 176664
Trg + Lig
Ki
nM
ΔG°
kcal/mole
IC50
nM
Kd
nM
EC50/IC50
nM
koff
s-1
kon
M-1s-1
pHTemp
°C
Cannabinoid receptor 2
(Homo sapiens (Human))
BDBM176664
(US9115121, 59)
Show SMILES COc1nc(NCCc2ccc(F)cc2)nc(n1)-c1ccc(CO)c(c1)S(=O)(=O)NC1CC1
Show InChI InChI=1S/C22H24FN5O4S/c1-32-22-26-20(25-21(27-22)24-11-10-14-2-6-17(23)7-3-14)15-4-5-16(13-29)19(12-15)33(30,31)28-18-8-9-18/h2-7,12,18,28-29H,8-11,13H2,1H3,(H,24,25,26,27)
Reactome pathway
US Patent
n/an/a 25n/an/an/an/an/an/a
Sanofi
US Patent
Assay Description
Affinity binding tests were performed according to the experimental conditions described by M. Rinaldi-Carmona in J. Pharmacol. Exp. Therap. 1998, 28...
US Patent US9115121 (2015)
BindingDB Entry DOI: 10.7270/Q23N225X