BDBM177071 US9120749, 437
SMILES: COc1cc(cc(Cl)c1O)-c1ccc2ncc(C(=O)C3CC3)c(N3CCN(CC3)C(=O)CN(C)C)c2c1
InChI Key: InChIKey=UQVVVEQIKFQOQQ-UHFFFAOYSA-N
Data: 1 IC50
Activity Spreadsheet -- Enzyme Inhibition Constant Data from BindingDB
Found 1 hit for monomerid = 177071
Trg + Lig
Ki
nM
ΔG°
kcal/mole
IC50
nM
Kd
nM
EC50/IC50
nM
koff
s-1
kon
M-1s-1
pHTemp
°C
Maternal embryonic leucine zipper kinase (MELK)
(Homo sapiens (Human))
BDBM177071
(US9120749, 437)
Show SMILES COc1cc(cc(Cl)c1O)-c1ccc2ncc(C(=O)C3CC3)c(N3CCN(CC3)C(=O)CN(C)C)c2c1
Show InChI InChI=1S/C28H31ClN4O4/c1-31(2)16-25(34)32-8-10-33(11-9-32)26-20-12-18(19-13-22(29)28(36)24(14-19)37-3)6-7-23(20)30-15-21(26)27(35)17-4-5-17/h6-7,12-15,17,36H,4-5,8-11,16H2,1-3H3
US Patent
n/an/a 1.10n/an/an/an/a7.425
ONCOTHERAPY SCIENCE, INC.
US Patent
Assay Description
MELK activity was determined in the presence or absence of compounds using fluorescein isothiocyanate-labeled (FITC-labeled) histone H3 peptide as a ...
US Patent US9120749 (2015)
BindingDB Entry DOI: 10.7270/Q2FX7872