null
SMILES: CN(C)CCc1ccc(Nc2c(cnc3ccc(cc23)-c2cc(Cl)c(O)c(Cl)c2)C(=O)C2CC2)cc1
InChI Key: InChIKey=XJSOWWAKKWSKJG-UHFFFAOYSA-N
Activity Spreadsheet -- Enzyme Inhibition Constant Data from BindingDB
Found 2 hits for monomerid = 177247
Trg + Lig
Ki
nM
ΔG°
kcal/mole
IC50
nM
Kd
nM
EC50/IC50
nM
koff
s-1
kon
M-1s-1
pHTemp
°C
Maternal embryonic leucine zipper kinase
(Homo sapiens (Human))
BDBM177247
(US9120749, 613 | US9120749, 614)
Show SMILES CN(C)CCc1ccc(Nc2c(cnc3ccc(cc23)-c2cc(Cl)c(O)c(Cl)c2)C(=O)C2CC2)cc1
Show InChI InChI=1S/C29H27Cl2N3O2/c1-34(2)12-11-17-3-8-21(9-4-17)33-27-22-13-19(20-14-24(30)29(36)25(31)15-20)7-10-26(22)32-16-23(27)28(35)18-5-6-18/h3-4,7-10,13-16,18,36H,5-6,11-12H2,1-2H3,(H,32,33)
US Patent
n/an/a 1.60n/an/an/an/a7.425
ONCOTHERAPY SCIENCE, INC.
US Patent
Assay Description
MELK activity was determined in the presence or absence of compounds using fluorescein isothiocyanate-labeled (FITC-labeled) histone H3 peptide as a ...
US Patent US9120749 (2015)
BindingDB Entry DOI: 10.7270/Q2FX7872
Maternal embryonic leucine zipper kinase
(Homo sapiens (Human))
BDBM177247
(US9120749, 613 | US9120749, 614)
Show SMILES CN(C)CCc1ccc(Nc2c(cnc3ccc(cc23)-c2cc(Cl)c(O)c(Cl)c2)C(=O)C2CC2)cc1
Show InChI InChI=1S/C29H27Cl2N3O2/c1-34(2)12-11-17-3-8-21(9-4-17)33-27-22-13-19(20-14-24(30)29(36)25(31)15-20)7-10-26(22)32-16-23(27)28(35)18-5-6-18/h3-4,7-10,13-16,18,36H,5-6,11-12H2,1-2H3,(H,32,33)
US Patent
n/an/a 2.20n/an/an/an/a7.425
ONCOTHERAPY SCIENCE, INC.
US Patent
Assay Description
MELK activity was determined in the presence or absence of compounds using fluorescein isothiocyanate-labeled (FITC-labeled) histone H3 peptide as a ...
US Patent US9120749 (2015)
BindingDB Entry DOI: 10.7270/Q2FX7872