BDBM17737 2,6-dimethylphenyl N-(2,4-dimethoxyphenyl)-N-[2-({4-[2-(dimethylamino)ethoxy]phenyl}amino)pyrimidin-4-yl]carbamate::2-aminopyrimidine carbamate, 36
SMILES: COc1ccc(N(C(=O)Oc2c(C)cccc2C)c2ccnc(Nc3ccc(OCCN(C)C)cc3)n2)c(OC)c1
InChI Key: InChIKey=PRFGCHAHYIAXCL-UHFFFAOYSA-N
Data: 4 IC50
Activity Spreadsheet -- Enzyme Inhibition Constant Data from BindingDB
Found 4 hits for monomerid = 17737
Trg + Lig
Ki
nM
ΔG°
kcal/mole
IC50
nM
Kd
nM
EC50/IC50
nM
koff
s-1
kon
M-1s-1
pHTemp
°C
Tyrosine-protein kinase Lck
(Homo sapiens (Human))
BDBM17737
(2,6-dimethylphenyl N-(2,4-dimethoxyphenyl)-N-[2-({...)
Show SMILES COc1ccc(N(C(=O)Oc2c(C)cccc2C)c2ccnc(Nc3ccc(OCCN(C)C)cc3)n2)c(OC)c1
Show InChI InChI=1S/C31H35N5O5/c1-21-8-7-9-22(2)29(21)41-31(37)36(26-15-14-25(38-5)20-27(26)39-6)28-16-17-32-30(34-28)33-23-10-12-24(13-11-23)40-19-18-35(3)4/h7-17,20H,18-19H2,1-6H3,(H,32,33,34)
n/an/a 1n/an/an/an/a7.522
Amgen
Assay Description
The assay involves the phosphorylation of a biotinylated substrate and the detection of this phosphorylation after the addition of a streptavidin-all...
J Med Chem 49: 4981-91 (2006)
Article DOI: 10.1021/jm060435i
BindingDB Entry DOI: 10.7270/Q2SB440C
Vascular endothelial growth factor receptor 2
(Homo sapiens (Human))
BDBM17737
(2,6-dimethylphenyl N-(2,4-dimethoxyphenyl)-N-[2-({...)
Show SMILES COc1ccc(N(C(=O)Oc2c(C)cccc2C)c2ccnc(Nc3ccc(OCCN(C)C)cc3)n2)c(OC)c1
Show InChI InChI=1S/C31H35N5O5/c1-21-8-7-9-22(2)29(21)41-31(37)36(26-15-14-25(38-5)20-27(26)39-6)28-16-17-32-30(34-28)33-23-10-12-24(13-11-23)40-19-18-35(3)4/h7-17,20H,18-19H2,1-6H3,(H,32,33,34)
NCI pathway
Reactome pathway
n/an/a 220n/an/an/an/an/an/a
Amgen
Assay Description
The assay involves the phosphorylation of a biotinylated substrate and the detection of this phosphorylation after the addition of a streptavidin-all...
J Med Chem 49: 4981-91 (2006)
Article DOI: 10.1021/jm060435i
BindingDB Entry DOI: 10.7270/Q2SB440C
Mitogen-activated protein kinase 14
(Homo sapiens (Human))
BDBM17737
(2,6-dimethylphenyl N-(2,4-dimethoxyphenyl)-N-[2-({...)
Show SMILES COc1ccc(N(C(=O)Oc2c(C)cccc2C)c2ccnc(Nc3ccc(OCCN(C)C)cc3)n2)c(OC)c1
Show InChI InChI=1S/C31H35N5O5/c1-21-8-7-9-22(2)29(21)41-31(37)36(26-15-14-25(38-5)20-27(26)39-6)28-16-17-32-30(34-28)33-23-10-12-24(13-11-23)40-19-18-35(3)4/h7-17,20H,18-19H2,1-6H3,(H,32,33,34)
NCI pathway
Reactome pathway
n/an/a 2.10E+3n/an/an/an/an/an/a
Amgen
Assay Description
The assay involves the phosphorylation of a biotinylated substrate and the detection of this phosphorylation after the addition of a streptavidin-all...
J Med Chem 49: 4981-91 (2006)
Article DOI: 10.1021/jm060435i
BindingDB Entry DOI: 10.7270/Q2SB440C
Proto-oncogene tyrosine-protein kinase Src
(Homo sapiens (Human))
BDBM17737
(2,6-dimethylphenyl N-(2,4-dimethoxyphenyl)-N-[2-({...)
Show SMILES COc1ccc(N(C(=O)Oc2c(C)cccc2C)c2ccnc(Nc3ccc(OCCN(C)C)cc3)n2)c(OC)c1
Show InChI InChI=1S/C31H35N5O5/c1-21-8-7-9-22(2)29(21)41-31(37)36(26-15-14-25(38-5)20-27(26)39-6)28-16-17-32-30(34-28)33-23-10-12-24(13-11-23)40-19-18-35(3)4/h7-17,20H,18-19H2,1-6H3,(H,32,33,34)
n/an/a 4n/an/an/an/an/an/a
Amgen
Assay Description
The assay involves the phosphorylation of a biotinylated substrate and the detection of this phosphorylation after the addition of a streptavidin-all...
J Med Chem 49: 4981-91 (2006)
Article DOI: 10.1021/jm060435i
BindingDB Entry DOI: 10.7270/Q2SB440C