BDBM177458 US9120749, 824
SMILES: CCC(=O)c1cnc2ccc(cc2c1Nc1ccc(nc1)N1CCCC(N)C1)-c1cc(Cl)c(O)c(Cl)c1
InChI Key: InChIKey=DLMHQUGZXIWVLQ-UHFFFAOYSA-N
Data: 1 IC50
Activity Spreadsheet -- Enzyme Inhibition Constant Data from BindingDB
Found 1 hit for monomerid = 177458
Trg + Lig
Ki
nM
ΔG°
kcal/mole
IC50
nM
Kd
nM
EC50/IC50
nM
koff
s-1
kon
M-1s-1
pHTemp
°C
Maternal embryonic leucine zipper kinase (MELK)
(Homo sapiens (Human))
BDBM177458
(US9120749, 824)
Show SMILES CCC(=O)c1cnc2ccc(cc2c1Nc1ccc(nc1)N1CCCC(N)C1)-c1cc(Cl)c(O)c(Cl)c1
Show InChI InChI=1S/C28H27Cl2N5O2/c1-2-25(36)21-14-32-24-7-5-16(17-11-22(29)28(37)23(30)12-17)10-20(24)27(21)34-19-6-8-26(33-13-19)35-9-3-4-18(31)15-35/h5-8,10-14,18,37H,2-4,9,15,31H2,1H3,(H,32,34)
US Patent
n/an/a 1.60n/an/an/an/a7.425
ONCOTHERAPY SCIENCE, INC.
US Patent
Assay Description
MELK activity was determined in the presence or absence of compounds using fluorescein isothiocyanate-labeled (FITC-labeled) histone H3 peptide as a ...
US Patent US9120749 (2015)
BindingDB Entry DOI: 10.7270/Q2FX7872