BDBM177470 US9120749, 836
SMILES: CN1CCC(CC1)n1cc(Nc2c(cnc3ccc(cc23)-c2cc(Cl)c(O)c(Cl)c2)C(C)=O)cn1
InChI Key: InChIKey=MXCQCHYDYFMOPM-UHFFFAOYSA-N
Data: 1 IC50
Activity Spreadsheet -- Enzyme Inhibition Constant Data from BindingDB
Found 1 hit for monomerid = 177470
Trg + Lig
Ki
nM
ΔG°
kcal/mole
IC50
nM
Kd
nM
EC50/IC50
nM
koff
s-1
kon
M-1s-1
pHTemp
°C
Maternal embryonic leucine zipper kinase (MELK)
(Homo sapiens (Human))
BDBM177470
(US9120749, 836)
Show SMILES CN1CCC(CC1)n1cc(Nc2c(cnc3ccc(cc23)-c2cc(Cl)c(O)c(Cl)c2)C(C)=O)cn1
Show InChI InChI=1S/C26H25Cl2N5O2/c1-15(34)21-13-29-24-4-3-16(17-10-22(27)26(35)23(28)11-17)9-20(24)25(21)31-18-12-30-33(14-18)19-5-7-32(2)8-6-19/h3-4,9-14,19,35H,5-8H2,1-2H3,(H,29,31)
US Patent
n/an/a 1.40n/an/an/an/a7.425
ONCOTHERAPY SCIENCE, INC.
US Patent
Assay Description
MELK activity was determined in the presence or absence of compounds using fluorescein isothiocyanate-labeled (FITC-labeled) histone H3 peptide as a ...
US Patent US9120749 (2015)
BindingDB Entry DOI: 10.7270/Q2FX7872